{"text_format":"1","workbook":"xlsx","n_sheets":10,"sheets":["Intro","Power Calculator","Loop Calculator","Templates","Data","Loop Calculation AutroSafe","Loop Calculation Autroprime","Data Own Units","Report","Temp"],"not_rendered":{"charts":0,"images":12,"macros":1,"external_links":0,"defined_names":2,"comments":0,"pivot_tables":0},"unopened":[],"bounds":{"document_bytes":16777216,"sheet_cells":100000,"rows_first":2000,"rows_last":500,"rows_between":2000,"halvings":0,"cell_chars":16384,"cell_head_chars":4096},"cells_cut":0,"cells_raw":0,"read":"whole","date_system":"1900"}

{"sheet":"Intro","index":0,"n_rows":67,"n_cols":3,"rows_kept":67,"cut":false,"hidden":true,"merged":[[0,0,1,1],[0,2,1,3]]}
["Powercalc",null,"V 1.0.5"]
[]
[]
["Disclaimer"]
["Using this PowerCalc Tool is a theoretical approach to calculate the power consumption in an AutroSafe system, thus the result may not  "]
["be 100% accurate. In a real installation there are many factors that influence the calculation, for example, cable length, resistance, "]
["connectors etc. that are not taken into consideration in this calculation."]
["The result from the calculation must always be reviewed and compared to a real installation."]
[]
["Instructions"]
[]
["There are two tools in this spreadsheet:"]
["Power Calculator","Calculates power for up to 10 AutroSafe systems."]
["Loop Calculator","Calculates power for a detector loop."]
[]
["Power Calculator"]
["Menu"]
[]
[null,"Will add a system, system must be given a name."]
[]
{"$rows_left_out":48}
{"sheet":"Power Calculator","index":1,"n_rows":108,"n_cols":10,"rows_kept":108,"cut":false,"hidden":true,"merged":[[0,0,1,1]]}
["Powercalc",null,null,null,"Project","(Insert Project Name)"]
[null,null,{"$f":"Intro!C1","v":"V 1.0.5"},null,"Date","(Insert date)"]
[null,"Dummy"]
[]
["System Name","AutroSafe_1"]
["Panels","Panel Type","Amount",null,"Load quiescent","Load alarm","Connect To Power",null,"Output"]
[null,"BS-420",null,null,{"$f":"IF($C7>0,VLOOKUP($B7,Data!$A$2:$C$139,2,FALSE)*$C7,\"\")","v":""},{"$f":"IF($C7>0,VLOOKUP($B7,Data!$A$2:$C$139,3,FALSE)*$C7,\"\")","v":""},null,false,"A1",false]
[null,"BC-420",null,null,{"$f":"IF($C8>0,VLOOKUP($B8,Data!$A$2:$C$139,2,FALSE)*$C8,\"\")","v":""},{"$f":"IF($C8>0,VLOOKUP($B8,Data!$A$2:$C$139,3,FALSE)*$C8,\"\")","v":""},null,false,"A1",false]
[null,"BC-440",null,null,{"$f":"IF($C9>0,VLOOKUP($B9,Data!$A$2:$C$139,2,FALSE)*$C9,\"\")","v":""},{"$f":"IF($C9>0,VLOOKUP($B9,Data!$A$2:$C$139,3,FALSE)*$C9,\"\")","v":""},null,false,"A1",false]
[null,"BS-430",null,null,{"$f":"IF($C10>0,VLOOKUP($B10,Data!$A$2:$C$139,2,FALSE)*$C10,\"\")","v":""},{"$f":"IF($C10>0,VLOOKUP($B10,Data!$A$2:$C$139,3,FALSE)*$C10,\"\")","v":""},null,false,"A1",false]
[null,"BU-420/BV-420",null,null,{"$f":"IF($C11>0,VLOOKUP($B11,Data!$A$2:$C$139,2,FALSE)*$C11,\"\")","v":""},{"$f":"IF($C11>0,VLOOKUP($B11,Data!$A$2:$C$139,3,FALSE)*$C11,\"\")","v":""},null,false,"A1",false]
["Modules","Module","Amount",null,"Load quiescent","Load alarm","Connect To Power",null,"Output"]
[null,"BSS-310A",null,null,{"$f":"IF($C13>0,VLOOKUP($B13,Data!$A$2:$C$139,2,FALSE)*$C13,\"\")","v":""},{"$f":"IF($C13>0,VLOOKUP($B13,Data!$A$2:$C$139,3,FALSE)*$C13,\"\")","v":""},null,false,"A1",false]
[null,"BSS-311",null,null,{"$f":"IF($C14>0,VLOOKUP($B14,Data!$A$2:$C$139,2,FALSE)*$C14,\"\")","v":""},{"$f":"IF($C14>0,VLOOKUP($B14,Data!$A$2:$C$139,3,FALSE)*$C14,\"\")","v":""},null,null,"A1"]
[null,"BSL-310",null,null,{"$f":"IF($C15>0,VLOOKUP($B15,Data!$A$2:$C$139,2,FALSE)*$C15,\"\")","v":""},{"$f":"IF($C15>0,VLOOKUP($B15,Data!$A$2:$C$139,3,FALSE)*$C15,\"\")","v":""}]
[null,"BSD-310",null,null,{"$f":"IF($C16>0,VLOOKUP($B16,Data!$A$2:$C$139,2,FALSE)*$C16,\"\")","v":""},{"$f":"IF($C16>0,VLOOKUP($B16,Data!$A$2:$C$139,3,FALSE)*$C16,\"\")","v":""}]
[null,"BSD-310/N",null,null,{"$f":"IF($C17>0,VLOOKUP($B17,Data!$A$2:$C$139,2,FALSE)*$C17,\"\")","v":""},{"$f":"IF($C17>0,VLOOKUP($B17,Data!$A$2:$C$139,3,FALSE)*$C17,\"\")","v":""}]
[null,"BSD-311",null,null,{"$f":"IF($C18>0,VLOOKUP($B18,Data!$A$2:$C$139,2,FALSE)*$C18,\"\")","v":""},{"$f":"IF($C18>0,VLOOKUP($B18,Data!$A$2:$C$139,3,FALSE)*$C18,\"\")","v":""}]
[null,"BSB-310A",null,null,{"$f":"IF($C19>0,VLOOKUP($B19,Data!$A$2:$C$139,2,FALSE)*$C19,\"\")","v":""},{"$f":"IF($C19>0,VLOOKUP($B19,Data!$A$2:$C$139,3,FALSE)*$C19,\"\")","v":""}]
[null,"BSB-310A Load",null,null,null,null,null,null,"A1"]
{"$rows_left_out":89}
{"sheet":"Loop Calculator","index":2,"n_rows":60,"n_cols":7,"rows_kept":60,"cut":false,"hidden":true,"merged":[[0,0,1,1],[4,5,4,6]]}
["Loop Calculator"]
[null,null,null,null,null,"Total load quiescent","Total load  alarm"]
[null,null,"Loop Driver   ","BSD-310",null,{"$f":"SUM(E9:E60)","v":0},{"$f":"SUM(F9:F60)","v":0}]
[null,null,"Maximum available loop current   ",{"$f":"IF(D3=\"BSD-310\",\"100 mA\",\"200 mA\")","v":"100 mA"},null,"Within Capacity",{"$f":"IF(D3=\"BSD-310\",IF(G3<100,\"OK\",\"No Fix\"),IF(G3<200,\"OK\",\"No Fix\"))","v":"OK"}]
[null,15,null,null,null,"Maximum loop cable length"]
[null,42,null,null,"Cable  Cross Section  ","BSD-310","BSD-311"]
[null,2,null,0.8,"0,75 mm2",{"$f":"VLOOKUP($E$7,Data!$J$2:$L$6,2,FALSE)","v":"1100 m"},{"$f":"VLOOKUP($E$7,Data!$J$2:$L$6,3,FALSE)","v":"430 m"}]
["Loop Units","AutroSafe Detectors","Amount","Total Activated simultanisly","Load quiescent","Load alarm"]
[null,"MultiSensors",null,null,{"$f":"IF($C9>0,VLOOKUP($B9,Data!$A$2:$C$139,2,FALSE)*$C9,\"\")","v":""},{"$f":"IF($C9>0,VLOOKUP($B9,Data!$A$2:$C$139,3,FALSE)*$C9,\"\")","v":""}]
[null,"Heat detectors",null,null,{"$f":"IF($C10>0,VLOOKUP($B10,Data!$A$2:$C$139,2,FALSE)*$C10,\"\")","v":""},{"$f":"IF($C10>0,VLOOKUP($B10,Data!$A$2:$C$139,3,FALSE)*$C10,\"\")","v":""}]
[null,"Optical detectors",null,null,{"$f":"IF($C11>0,VLOOKUP($B11,Data!$A$2:$C$139,2,FALSE)*$C11,\"\")","v":""},{"$f":"IF($C11>0,VLOOKUP($B11,Data!$A$2:$C$139,3,FALSE)*$C11,\"\")","v":""}]
[null,"Manual callpoints",null,null,{"$f":"IF($C12>0,VLOOKUP($B12,Data!$A$2:$C$139,2,FALSE)*$C12,\"\")","v":""},{"$f":"IF($C12>0,VLOOKUP($B12,Data!$A$2:$C$139,3,FALSE)*$C12,\"\")","v":""}]
[null,"Flame (BG-201)",null,null,{"$f":"IF($C13>0,VLOOKUP($B13,Data!$A$2:$C$139,2,FALSE)*$C13,\"\")","v":""},{"$f":"IF($C13>0,VLOOKUP($B13,Data!$A$2:$C$139,3,FALSE)*$C13,\"\")","v":""}]
[null,"AutroSafe Total No Of LEDs per loop",null,null,{"$f":"IF($D14>0,VLOOKUP($B14,Data!$A$2:$C$139,2,FALSE)*$C14,\"\")","v":""},{"$f":"IF($D14>0,VLOOKUP($B14,Data!$A$2:$C$139,3,FALSE)*$D14,\"\")","v":""}]
[null,"AutroGuard® Protectors","Amount","Total Activated simultanisly","Load quiescent","Load alarm"]
["For AutroGuard®","Total no. of AutroGuard®",null,null,{"$f":"IF($C16>0,VLOOKUP($B16,Data!$A$2:$C$139,2,FALSE)*$C16,\"\")","v":""},{"$f":"IF($C16>0,VLOOKUP($B16,Data!$A$2:$C$139,3,FALSE)*$C16,\"\")","v":""}]
[" 1. Add total number of","Sounders low volume",null,null,{"$f":"IF($C17>0,VLOOKUP($B17,Data!$A$2:$C$139,2,FALSE)*$C17,\"\")","v":""},{"$f":"IF($D17>0,VLOOKUP($B17,Data!$A$2:$C$139,3,FALSE)*$D17+(($C17-$D17)*VLOOKUP($B17,Data!$A$2:$C$139,2,FALSE)),\"\")","v":""}]
["      detectors","Sounders high volume",null,null,{"$f":"IF($C18>0,VLOOKUP($B18,Data!$A$2:$C$139,2,FALSE)*$C18,\"\")","v":""},{"$f":"IF($D18>0,VLOOKUP($B18,Data!$A$2:$C$139,3,FALSE)*$D18+(($C18-$D18)*VLOOKUP($B18,Data!$A$2:$C$139,2,FALSE)),\"\")","v":""}]
[null,"VAD White Low Int. (C-3-6) 1Hz",null,null,{"$f":"IF($C19>0,VLOOKUP($B19,Data!$A$2:$C$139,2,FALSE)*$C19,\"\")","v":""},{"$f":"IF($D19>0,VLOOKUP($B19,Data!$A$2:$C$139,3,FALSE)*$D19+(($C19-$D19)*VLOOKUP($B19,Data!$A$2:$C$139,2,FALSE)),\"\")","v":""}]
["2. Add total number of","VAD White Med. Int. (C-3-9) 1Hz",null,null,{"$f":"IF($C20>0,VLOOKUP($B20,Data!$A$2:$C$139,2,FALSE)*$C20,\"\")","v":""},{"$f":"IF($D20>0,VLOOKUP($B20,Data!$A$2:$C$139,3,FALSE)*$D20+(($C20-$D20)*VLOOKUP($B20,Data!$A$2:$C$139,2,FALSE)),\"\")","v":""}]
{"$rows_left_out":41}
{"sheet":"Templates","index":3,"n_rows":105,"n_cols":25,"rows_kept":105,"cut":false,"hidden":true,"merged":[[3,12,3,14],[40,24,41,24],[40,20,41,20],[40,21,41,21],[40,22,41,22],[40,23,41,23]]}
["System Template",null,null,null,null,null,null,null,null,null,null,"Power Template",null,null,null,null,null,null,null,null,"Report Template Heading"]
["System Name",null,null,null,null,null,null,null,null,null,null,"Power Name",null,null,null,null,null,null,null,null,"Power Calculation Report"]
["Panels","Panel Type","Amount",null,"Load quiescent","Load alarm","Connect To Power",null,"Output"]
[null,"BS-420",null,null,{"$f":"IF($C4>0,VLOOKUP($B4,Data!$A$2:$C$139,2,FALSE)*$C4,\"\")","v":""},{"$f":"IF($C4>0,VLOOKUP($B4,Data!$A$2:$C$139,3,FALSE)*$C4,\"\")","v":""},null,false,"A1",false,null,"Type","BPS-405 W/Battery",null,null,{"$f":"PowerCapacity(M4)","v":"      2A Each output, 3A total and 2A charging"},null,null,null,null,"Project",null,null,"Date   "]
[null,"BC-420",null,null,{"$f":"IF($C5>0,VLOOKUP($B5,Data!$A$2:$C$139,2,FALSE)*$C5,\"\")","v":""},{"$f":"IF($C5>0,VLOOKUP($B5,Data!$A$2:$C$139,3,FALSE)*$C5,\"\")","v":""},null,false,"A1",false,null,"Load","A1","A2","B1","B2","C1","C2","Totally"]
[null,"BC-440",null,null,{"$f":"IF($C6>0,VLOOKUP($B6,Data!$A$2:$C$139,2,FALSE)*$C6,\"\")","v":""},{"$f":"IF($C6>0,VLOOKUP($B6,Data!$A$2:$C$139,3,FALSE)*$C6,\"\")","v":""},null,false,"A1",false,null,"Load Quiescent",{"$f":"CalculatePower($M4,\"Quiescent\",$M2,M5)","v":0},{"$f":"CalculatePower($M4,\"Quiescent\",$M2,N5)","v":0},{"$f":"CalculatePower($M4,\"Quiescent\",$M2,O5)","v":0},{"$f":"CalculatePower($M4,\"Quiescent\",$M2,P5)","v":0},{"$f":"CalculatePower($M4,\"Quiescent\",$M2,Q5)","v":0},{"$f":"CalculatePower($M4,\"Quiescent\",$M2,R5)","v":0},{"$f":"SUM(M6:R6)","v":0}]
[null,"BS-430",null,null,{"$f":"IF($C7>0,VLOOKUP($B7,Data!$A$2:$C$139,2,FALSE)*$C7,\"\")","v":""},{"$f":"IF($C7>0,VLOOKUP($B7,Data!$A$2:$C$139,3,FALSE)*$C7,\"\")","v":""},null,false,"A1",false,null,"Load Alarm",{"$f":"CalculatePower($M4,\"Alarm\",$M2,M5)","v":0},{"$f":"CalculatePower($M4,\"Alarm\",$M2,N5)","v":0},{"$f":"CalculatePower($M4,\"Alarm\",$M2,O5)","v":0},{"$f":"CalculatePower($M4,\"Alarm\",$M2,P5)","v":0},{"$f":"CalculatePower($M4,\"Alarm\",$M2,Q5)","v":0},{"$f":"CalculatePower($M4,\"Alarm\",$M2,R5)","v":0},{"$f":"SUM(M7:R7)","v":0}]
[null,"BU-420/BV-420",null,null,{"$f":"IF($C8>0,VLOOKUP($B8,Data!$A$2:$C$139,2,FALSE)*$C8,\"\")","v":""},{"$f":"IF($C8>0,VLOOKUP($B8,Data!$A$2:$C$139,3,FALSE)*$C8,\"\")","v":""},null,false,"A1",false,null,"Within capacity",{"$f":"CalculateA1(M4,M7)","v":"Yes"},{"$f":"IF(N7>2000,\"No, Fix\",\"Yes\")","v":"Yes"},"Yes","Yes","Yes","Yes"]
["Modules","Module","Amount",null,"Load quiescent","Load alarm","Connect To Power",null,"Output",null,null,"Totally Alarm",{"$f":"S7","v":0}]
[null,"BSS-310A",null,null,{"$f":"IF($C10>0,VLOOKUP($B10,Data!$A$2:$C$139,2,FALSE)*$C10,\"\")","v":""},{"$f":"IF($C10>0,VLOOKUP($B10,Data!$A$2:$C$139,3,FALSE)*$C10,\"\")","v":""},null,false,"A1",false,null,"Within capacity",{"$f":"WithinCapacity(M4,M9)","v":"Yes"},null,null,null,null,null,null,null,"Report Template System"]
[null,"BSS-311",null,null,{"$f":"IF($C11>0,VLOOKUP($B11,Data!$A$2:$C$139,2,FALSE)*$C11,\"\")","v":""},{"$f":"IF($C11>0,VLOOKUP($B11,Data!$A$2:$C$139,3,FALSE)*$C11,\"\")","v":""},null,null,"A1",null,null,"Battery",null,null,null,null,null,null,null,null,"System"]
[null,"BSL-310",null,null,{"$f":"IF($C12>0,VLOOKUP($B12,Data!$A$2:$C$139,2,FALSE)*$C12,\"\")","v":""},{"$f":"IF($C12>0,VLOOKUP($B12,Data!$A$2:$C$139,3,FALSE)*$C12,\"\")","v":""},null,null,null,null,null,"Hour req. Std.by",24,null,"Min Battery Size (AH)",null,null,null,{"$f":"MinBatterySize(M4,M12,M13,S6,S7)","v":"3"},null,"Type","Number","Load quiescent","Load alarm"]
[null,"BSD-310",null,null,{"$f":"IF($C13>0,VLOOKUP($B13,Data!$A$2:$C$139,2,FALSE)*$C13,\"\")","v":""},{"$f":"IF($C13>0,VLOOKUP($B13,Data!$A$2:$C$139,3,FALSE)*$C13,\"\")","v":""},null,null,null,null,null,"Hour req. Alarm",0.5,null,"Availible For Charging",null,null,null,{"$f":"ChargingAvail(M4,S6)","v":"2000"},null,"Panels"]
[null,"BSD-310/N",null,null,{"$f":"IF($C14>0,VLOOKUP($B14,Data!$A$2:$C$139,2,FALSE)*$C14,\"\")","v":""},{"$f":"IF($C14>0,VLOOKUP($B14,Data!$A$2:$C$139,3,FALSE)*$C14,\"\")","v":""},null,null,null,null,null,null,null,null,"Max battery 24 hour charging (AH)",null,null,null,{"$f":"MaxBattery24HCharging(S13)","v":"38"},null,"Modules"]
[null,"BSD-311",null,null,{"$f":"IF($C15>0,VLOOKUP($B15,Data!$A$2:$C$139,2,FALSE)*$C15,\"\")","v":""},{"$f":"IF($C15>0,VLOOKUP($B15,Data!$A$2:$C$139,3,FALSE)*$C15,\"\")","v":""},null,null,null,null,null,null,null,null,null,null,null,null,null,null,"Detectors"]
[null,"BSB-310A",null,null,{"$f":"IF($C16>0,VLOOKUP($B16,Data!$A$2:$C$139,2,FALSE)*$C16,\"\")","v":""},{"$f":"IF($C16>0,VLOOKUP($B16,Data!$A$2:$C$139,3,FALSE)*$C16,\"\")","v":""},null,null,null,null,null,null,null,null,null,null,null,null,null,null,"AutroGuard®"]
[null,"BSB-310A Load",null,null,null,null,null,null,"A1",null,null,null,null,null,null,null,null,null,null,null,"I/O Units"]
[null,"BSJ-310",null,null,{"$f":"IF($C18>0,VLOOKUP($B18,Data!$A$2:$C$139,2,FALSE)*$C18,\"\")","v":""},{"$f":"IF($C18>0,VLOOKUP($B18,Data!$A$2:$C$139,3,FALSE)*$C18,\"\")","v":""},null,null,null,null,null,null,null,null,null,null,null,null,null,null,"Sounders/Strobes"]
[null,"BSE-310",null,null,{"$f":"IF($C19>0,VLOOKUP($B19,Data!$A$2:$C$139,2,FALSE)*$C19,\"\")","v":""},{"$f":"IF($C19>0,VLOOKUP($B19,Data!$A$2:$C$139,3,FALSE)*$C19,\"\")","v":""},null,null,null,null,null,null,null,null,null,null,null,null,null,null,"Other Loop Units"]
[null,"BSE-320",null,null,{"$f":"IF($C20>0,VLOOKUP($B20,Data!$A$2:$C$139,2,FALSE)*$C20,\"\")","v":""},{"$f":"IF($C20>0,VLOOKUP($B20,Data!$A$2:$C$139,3,FALSE)*$C20,\"\")","v":""},null,null,null,null,null,null,null,null,null,null,null,null,null,null,"Special Detection"]
{"$rows_left_out":86}
{"sheet":"Data","index":4,"n_rows":133,"n_cols":14,"rows_kept":133,"cut":false,"hidden":true,"merged":[]}
["Item","Data quiescent","Data quiescent",null,null,"Power supply","Power Outputs","Power Names","Loop Driver","Cable  Cross Section","Length 310 BSD-310","Length BSD-311","VAD Variants","Sounders"]
["BC-420",156,340,null,null,"BPS-405 W/Battery","A1",null,"BSD-310","0,75 mm2","1100 m","430 m","VAD White High Int. (C-3-12) 0,5Hz","BBL-100"]
["BC-440",125,125,null,null,"BPS-410 W/Battery","A2",null,"BSD-311","1 mm2","1470 m","580 m","VAD White High Int. (C-3-12) 1Hz","BBR-110"]
["BS-420",156,340,null,null,"BPS-405 WO/Battery","B1",null,null,"1,5 mm2","2200 m","870 m","VAD White Med. Int. (C-3-9) 0,5Hz","BBR-130 LP"]
["BS-430",156,340,null,null,"BPS-410 WO/Battery","B2",null,null,"2 mm2","2940 m","1160 m","VAD White Med. Int. (C-3-9) 1Hz","BBR-130 HP"]
["BU-420/BV-420",156,220,null,null,"Power Cabinet STX 24V/2A","C1",null,null,"2,5 mm2","3670 m","1450 m","VAD White Low Int. (C-3-6) 0,5Hz","BBR-200"]
[null,null,null,null,null,"Power Cabinet STX 24V/5A","C2",null,null,null,null,null,"VAD White Low Int. (C-3-6) 1Hz","BBR-230 LP"]
["BSE-310",15,15,null,null,"Power Cabinet STX 24V/10A",null,null,null,null,null,null,"VAD White Open Int. (O-2,5-4) 0,5Hz","BBR-230 HP"]
["BSE-320",7,7,null,null,null,null,null,null,null,null,null,"VAD White Open Int. (O-2,5-4) 1Hz","BBQ-130 LP"]
["BSJ-310",10,20,null,null,null,null,null,null,null,null,null,"VAD Red High Int. (C-3-8) 0,5Hz","BBQ-130 HP"]
["BSB-310A",37,80,null,null,null,null,null,null,null,null,null,"VAD Red High Int. (C-3-8) 1Hz","BBQ-130 Indicator"]
["BSS-311",14,14,null,null,null,null,null,null,null,null,null,"VAD Red Low Int. (C-3-5) 0,5Hz","BBQ-130 Indicator+LP"]
["BSS-310A",40,40,null,null,null,null,null,null,null,null,null,"VAD Red Low Int. (C-3-5) 1Hz","BBQ-130 Indicator+HP"]
["BSL-310",15,15,null,null,null,null,null,null,null,null,null,"VAD Red Open Int. (O-2,5-4) 0,5Hz","BBQ-230 LP"]
["BSD-330",12,12,null,null,null,null,null,null,null,null,null,"VAD Red Open Int. (O-2,5-4) 1Hz","BBQ-230 HP"]
["BSD-310",10,10,null,null,null,null,null,null,null,null,null,null,"BBQ-230 Indicator"]
["BSD-310/N",10,10,null,null,null,null,null,null,null,null,null,null,"BBQ-230 Indicator+LP"]
["BSD-311",10,10,null,null,null,null,null,null,null,null,null,null,"BBQ-230 Indicator+HP"]
[null,null,null,null,null,null,null,null,null,null,null,null,null,"BN-307 (AlCom)"]
["Multisensors",0.3,0.3]
{"$rows_left_out":114}
{"sheet":"Loop Calculation AutroSafe","index":5,"n_rows":46,"n_cols":4,"rows_kept":46,"cut":false,"hidden":false,"merged":[[0,0,0,2]]}
["Loop Calculator AutroSafe"]
["Loop Unit Type","No Of Units","Current Consumption/unit (mA)","Current Consumption (mA)"]
["AutroGuard"]
["V-430",null,0.12,{"$f":"IF(B4<>\"\",B4*C4,\"\")","v":""}]
["V-430-CO",null,0.3,{"$f":"IF(B5<>\"\",B5*C5,\"\")","v":""}]
["AutroGuard AddOn *"]
[" -S              Sounder Low Volume",null,2.5099999999999998,{"$f":"IF(B7<>\"\",B7*C7,\"\")","v":""}]
[" -S              Sounder High Volume",null,6.13,""]
[" -VADW      VAD White  Open Class (O-2,5-4)  ",null,4.8,""]
[" -VADW      VAD White  Low intensity  (C-3-6)",null,10.6,""]
[" -VADW      VAD White  Normal intensity  (C-3-9)",null,13.8,""]
[" -VADW      VAD White  high intensity  (C-3-12)",null,21,""]
[" -VADR       VAD Red  Open Class  (O-2,5-4)",null,8.5,""]
[" -VADR       VAD Red Low intensity  (C-3-5)",null,12.8,""]
[" -VADR       VAD Red High intensity  (C-3-8)",null,19.7,""]
["Other Units"]
[" BN-303, BN-303/LS",null,0.06,{"$f":"IF(B17<>\"\",B17*C17,\"\")","v":""}]
[" BN-304",null,0.06,""]
[" BN-305",null,0.1,""]
[" BN-307",null,0.06,""]
{"$rows_left_out":27}
{"sheet":"Loop Calculation Autroprime","index":6,"n_rows":36,"n_cols":6,"rows_kept":36,"cut":false,"hidden":false,"merged":[[0,0,0,2]]}
["Loop Calculator Autroprime"]
["Loop Unit Type","No Of Units","Addresses/Unit","Total No. Of Addresses","Current Consumption/unit (mA)","Current Consumption (mA)"]
["AutroGuard"]
[" V-430 - detector",null,1,{"$f":"IF(B4<>\"\",B4*C4,\"\")","v":""},0.12,{"$f":"IF(B4<>\"\",B4*E4,\"\")","v":""}]
[" V-430-CO - detector",null,1,{"$f":"IF(B5<>\"\",B5*C5,\"\")","v":""},0.3,{"$f":"IF(B5<>\"\",B5*E5,\"\")","v":""}]
[" V-430-S - detector with/sounder",null,3,{"$f":"IF(B6<>\"\",B6*C6,\"\")","v":""},6.25,{"$f":"IF(B6<>\"\",B6*E6,\"\")","v":""}]
[" V-430-VADW - detector with/VAD white",null,3,"",4.9800000000000004,{"$f":"IF(B7<>\"\",B7*E7,\"\")","v":""}]
[" V-430-VADR - detector with/VAD red",null,3,"",8.68,""]
[" V-430-S-VADW - detector with/sounder and VAD white",null,3,"",10.95,""]
[" V-430-S-VADR - detector with/sounder and  VAD red",null,3,"",14.65,""]
["Other Units"]
[" BN-303, BN-303/LS",null,2,{"$f":"IF(B12<>\"\",B12*C12,\"\")","v":""},0.06,{"$f":"IF(B12<>\"\",B12*E12,\"\")","v":""}]
[" BN-304",null,3,"",0.06,""]
[" BN-305",null,5,"",0.1,""]
[" BN-307",null,1,"",0.06,""]
[" Other I/O-units, Manual Callpoints, BG-201",null,1,"",0.3,""]
[" BHH/BDH series detectors incl. BD-200PT",null,1,"",0.3,""]
[" BBR-130/BBR-230 Sounder ",null,1,"",5,""]
[" BBQ-130 Sounder/VAD ",null,1,"",8.56,""]
[" BBQ-230 Sounder/VAD Red ",null,1,"",8.6,""]
{"$rows_left_out":17}
{"sheet":"Data Own Units","index":7,"n_rows":2,"n_cols":3,"rows_kept":2,"cut":false,"hidden":true,"merged":[]}
[null,"Load quiecent","Load Alarm"]
["Example",10,20]

{"sheet":"Report","index":8,"n_rows":0,"n_cols":0,"rows_kept":0,"cut":false,"hidden":true,"merged":[]}

{"sheet":"Temp","index":9,"n_rows":0,"n_cols":0,"rows_kept":0,"cut":false,"hidden":true,"merged":[]}